{"text_format":"3","workbook":"xlsx","n_sheets":11,"sheets":["User Manual","Dashboard","Sales","Product Master","Customer Master","Supplier Master","Purchase Entry","Stock Register","Reports","Sales_Log","Invoice_Print"],"not_rendered":{"charts":2,"macros":1},"read":"whole","date_system":"1900"}

{"sheet":"User Manual","index":0,"n_rows":94,"n_cols":3,"rows_kept":94,"merged":[[0,0,0,2],[1,0,1,2],[3,0,3,2],[12,0,12,2],[25,0,25,2],[32,0,32,2],[43,0,43,2],[44,0,44,2],[45,0,45,2],[47,0,47,2],[52,0,52,2],[53,0,53,2],[55,0,55,2],[56,0,56,2],[57,0,57,2],[58,0,58,2],[59,0,59,2],[61,0,61,2],[62,0,62,2],[64,0,64,2],[65,0,65,2],[67,0,67,2],[68,0,68,2],[70,0,70,2],[80,0,80,2],[81,0,81,2],[82,0,82,2],[83,0,83,2],[84,0,84,2],[86,0,86,2],[93,0,93,2]]}
["📘 POS & INVENTORY SYSTEM — USER MANUAL"]
["A complete beginner-friendly guide to operating this workbook"]
[]
["1.  ONE-TIME SETUP"]
["Step","Action"]
[1.1,"Save the file as Excel Macro-Enabled Workbook (.xlsm). File → Save As → choose type '.xlsm'."]
[1.2,"Enable macros: when Excel shows a yellow security bar, click 'Enable Content'."]
[1.3,"Press Alt+F11 to open the VBA editor → Insert → Module → paste the VBA code provided → close the editor."]
[1.4,"Show the Developer tab: File → Options → Customize Ribbon → tick 'Developer'."]
[1.5,"On the Sales sheet, draw 4 buttons over the colored boxes in row 21 (Developer → Insert → Button) and assign macros: SaveSale, PrintInvoice, ClearForm, GoDashboard."]
[1.6,"Edit the shop name, address and GSTIN at the top of Invoice_Print (rows 3–5)."]
[]
["2.  SHEET MAP — what each tab does"]
["Sheet","Purpose","Where you type"]
["Dashboard","KPIs (Sales, Purchase, Profit, Low-Stock count) + charts","Read-only — auto updates"]
{"$rows_left_out":80}
{"sheet":"Dashboard","index":1,"n_rows":17,"n_cols":11,"rows_kept":17,"merged":[[0,0,0,7],[5,0,5,2],[5,4,5,6]]}
["📈 INVENTORY & POS DASHBOARD"]
[]
["TOTAL SALES",null,"TOTAL PURCHASE",null,"TOTAL PROFIT",null,"LOW / OUT STOCK",null,null,"Sales",{"$f":"A4","v":0}]
[{"$f":"SUM(Sales_Log!J:J)","v":{"v":0,"d":"₹0"}},null,{"$f":"SUM('Purchase Entry'!K:K)","v":{"v":1770,"d":"₹1,770"}},null,{"$f":"SUM(Sales_Log!O:O)","v":{"v":0,"d":"₹0"}},null,{"$f":"COUNTIF('Stock Register'!H:H,\"LOW STOCK\")+COUNTIF('Stock Register'!H:H,\"OUT OF STOCK\")","v":44},null,null,"Purchase",{"$f":"C4","v":1770}]
[{"$nulls":9},"Profit",{"$f":"E4","v":0}]
["TOP SELLING PRODUCTS (by Qty)",{"$nulls":3},"LOW STOCK ALERT"]
["Product","Qty Sold","Revenue",null,"Product","Stock","Status"]
[{"$f":"IFERROR('Product Master'!B2,\"\")","v":"Sample Soap"},{"$f":"IFERROR(SUMIFS(Sales_Log!E:E,Sales_Log!C:C,'Product Master'!A2),0)","v":0},{"$f":"IFERROR(SUMIFS(Sales_Log!J:J,Sales_Log!C:C,'Product Master'!A2),0)","v":{"v":0,"d":"₹0.00"}},null,{"$f":"IFERROR('Stock Register'!B4,\"\")","v":"Sample Soap"},{"$f":"IFERROR('Stock Register'!F4,\"\")","v":150},{"$f":"IFERROR('Stock Register'!H4,\"\")","v":"OK"}]
[{"$f":"IFERROR('Product Master'!B3,\"\")","v":"Sample Shampoo"},{"$f":"IFERROR(SUMIFS(Sales_Log!E:E,Sales_Log!C:C,'Product Master'!A3),0)","v":0},{"$f":"IFERROR(SUMIFS(Sales_Log!J:J,Sales_Log!C:C,'Product Master'!A3),0)","v":{"v":0,"d":"₹0.00"}},null,{"$f":"IFERROR('Stock Register'!B5,\"\")","v":"Sample Shampoo"},{"$f":"IFERROR('Stock Register'!F5,\"\")","v":50},{"$f":"IFERROR('Stock Register'!H5,\"\")","v":"OK"}]
[{"$f":"IFERROR('Product Master'!B4,\"\")","v":"Notebook A4"},{"$f":"IFERROR(SUMIFS(Sales_Log!E:E,Sales_Log!C:C,'Product Master'!A4),0)","v":0},{"$f":"IFERROR(SUMIFS(Sales_Log!J:J,Sales_Log!C:C,'Product Master'!A4),0)","v":{"v":0,"d":"₹0.00"}},null,{"$f":"IFERROR('Stock Register'!B6,\"\")","v":"Notebook A4"},{"$f":"IFERROR('Stock Register'!F6,\"\")","v":200},{"$f":"IFERROR('Stock Register'!H6,\"\")","v":"OK"}]
[{"$f":"IFERROR('Product Master'!B5,\"\")","v":0},{"$f":"IFERROR(SUMIFS(Sales_Log!E:E,Sales_Log!C:C,'Product Master'!A5),0)","v":0},{"$f":"IFERROR(SUMIFS(Sales_Log!J:J,Sales_Log!C:C,'Product Master'!A5),0)","v":{"v":0,"d":"₹0.00"}},null,{"$f":"IFERROR('Stock Register'!B7,\"\")","v":0},{"$f":"IFERROR('Stock Register'!F7,\"\")","v":0},{"$f":"IFERROR('Stock Register'!H7,\"\")","v":"OUT OF STOCK"}]
[{"$f":"IFERROR('Product Master'!B6,\"\")","v":0},{"$f":"IFERROR(SUMIFS(Sales_Log!E:E,Sales_Log!C:C,'Product Master'!A6),0)","v":0},{"$f":"IFERROR(SUMIFS(Sales_Log!J:J,Sales_Log!C:C,'Product Master'!A6),0)","v":{"v":0,"d":"₹0.00"}},null,{"$f":"IFERROR('Stock Register'!B8,\"\")","v":0},{"$f":"IFERROR('Stock Register'!F8,\"\")","v":0},{"$f":"IFERROR('Stock Register'!H8,\"\")","v":"OUT OF STOCK"}]
[{"$f":"IFERROR('Product Master'!B7,\"\")","v":0},{"$f":"IFERROR(SUMIFS(Sales_Log!E:E,Sales_Log!C:C,'Product Master'!A7),0)","v":0},{"$f":"IFERROR(SUMIFS(Sales_Log!J:J,Sales_Log!C:C,'Product Master'!A7),0)","v":{"v":0,"d":"₹0.00"}},null,{"$f":"IFERROR('Stock Register'!B9,\"\")","v":0},{"$f":"IFERROR('Stock Register'!F9,\"\")","v":0},{"$f":"IFERROR('Stock Register'!H9,\"\")","v":"OUT OF STOCK"}]
[{"$f":"IFERROR('Product Master'!B8,\"\")","v":0},{"$f":"IFERROR(SUMIFS(Sales_Log!E:E,Sales_Log!C:C,'Product Master'!A8),0)","v":0},{"$f":"IFERROR(SUMIFS(Sales_Log!J:J,Sales_Log!C:C,'Product Master'!A8),0)","v":{"v":0,"d":"₹0.00"}},null,{"$f":"IFERROR('Stock Register'!B10,\"\")","v":0},{"$f":"IFERROR('Stock Register'!F10,\"\")","v":0},{"$f":"IFERROR('Stock Register'!H10,\"\")","v":"OUT OF STOCK"}]
[{"$f":"IFERROR('Product Master'!B9,\"\")","v":0},{"$f":"IFERROR(SUMIFS(Sales_Log!E:E,Sales_Log!C:C,'Product Master'!A9),0)","v":0},{"$f":"IFERROR(SUMIFS(Sales_Log!J:J,Sales_Log!C:C,'Product Master'!A9),0)","v":{"v":0,"d":"₹0.00"}},null,{"$f":"IFERROR('Stock Register'!B11,\"\")","v":0},{"$f":"IFERROR('Stock Register'!F11,\"\")","v":0},{"$f":"IFERROR('Stock Register'!H11,\"\")","v":"OUT OF STOCK"}]
{"$rows_left_out":3}
{"sheet":"Sales","index":2,"n_rows":23,"n_cols":10,"rows_kept":23,"merged":[[0,0,0,9],[20,0,20,1],[20,2,20,3],[20,4,20,5],[20,6,20,7],[22,0,22,9]]}
["🧾 POS BILLING SCREEN"]
[]
["Invoice No:",{"$f":"\"INV-\"&TEXT(COUNTA(Sales_Log!A:A),\"0000\")","v":"INV-0001"},null,"Date:",{"$f":"TODAY()","v":"2026-05-01"},null,"Payment Mode:","Cash"]
["Customer ID:","C001",null,"Customer Name:",{"$f":"IFERROR(VLOOKUP(B4,'Customer Master'!A:B,2,FALSE),\"\")","v":"Walk-in Customer"},null,"Phone:",{"$f":"IFERROR(VLOOKUP(B4,'Customer Master'!A:C,3,FALSE),\"\")","v":"-"}]
[]
["#","Product ID","Product Name","Stock Avail.","Qty","Price","Taxable","GST %","GST Amt","Total"]
[1,"P001",{"$f":"IFERROR(VLOOKUP(B7,'Product Master'!A:B,2,FALSE),\"\")","v":"Sample Soap"},{"$f":"IFERROR(VLOOKUP(B7,'Product Master'!A:I,9,FALSE),0)","v":150},null,{"$f":"IFERROR(VLOOKUP(B7,'Product Master'!A:E,5,FALSE),0)","v":{"v":50,"d":"₹50.00"}},{"$f":"IFERROR(E7*F7,0)","v":{"v":0,"d":"₹0.00"}},{"$f":"IFERROR(VLOOKUP(B7,'Product Master'!A:F,6,FALSE),0)","v":{"v":0.18,"d":"18%"}},{"$f":"G7*H7","v":{"v":0,"d":"₹0.00"}},{"$f":"G7+I7","v":{"v":0,"d":"₹0.00"}}]
[1,"P002",{"$f":"IFERROR(VLOOKUP(B8,'Product Master'!A:B,2,FALSE),\"\")","v":"Sample Shampoo"},{"$f":"IFERROR(VLOOKUP(B8,'Product Master'!A:I,9,FALSE),0)","v":50},null,{"$f":"IFERROR(VLOOKUP(B8,'Product Master'!A:E,5,FALSE),0)","v":{"v":180,"d":"₹180.00"}},{"$f":"IFERROR(E8*F8,0)","v":{"v":0,"d":"₹0.00"}},{"$f":"IFERROR(VLOOKUP(B8,'Product Master'!A:F,6,FALSE),0)","v":{"v":0.18,"d":"18%"}},{"$f":"G8*H8","v":{"v":0,"d":"₹0.00"}},{"$f":"G8+I8","v":{"v":0,"d":"₹0.00"}}]
[1,null,{"$f":"IFERROR(VLOOKUP(B9,'Product Master'!A:B,2,FALSE),\"\")","v":""},{"$f":"IFERROR(VLOOKUP(B9,'Product Master'!A:I,9,FALSE),0)","v":0},null,{"$f":"IFERROR(VLOOKUP(B9,'Product Master'!A:E,5,FALSE),0)","v":{"v":0,"d":"₹0.00"}},{"v":0,"d":"₹0.00"},{"$f":"IFERROR(VLOOKUP(B9,'Product Master'!A:F,6,FALSE),0)","v":{"v":0,"d":"0%"}},{"v":0,"d":"₹0.00"},{"v":0,"d":"₹0.00"}]
[1,null,{"$f":"IFERROR(VLOOKUP(B10,'Product Master'!A:B,2,FALSE),\"\")","v":""},{"$f":"IFERROR(VLOOKUP(B10,'Product Master'!A:I,9,FALSE),0)","v":0},null,{"$f":"IFERROR(VLOOKUP(B10,'Product Master'!A:E,5,FALSE),0)","v":{"v":0,"d":"₹0.00"}},{"v":0,"d":"₹0.00"},{"$f":"IFERROR(VLOOKUP(B10,'Product Master'!A:F,6,FALSE),0)","v":{"v":0,"d":"0%"}},{"v":0,"d":"₹0.00"},{"v":0,"d":"₹0.00"}]
[1,null,{"$f":"IFERROR(VLOOKUP(B11,'Product Master'!A:B,2,FALSE),\"\")","v":""},{"$f":"IFERROR(VLOOKUP(B11,'Product Master'!A:I,9,FALSE),0)","v":0},null,{"$f":"IFERROR(VLOOKUP(B11,'Product Master'!A:E,5,FALSE),0)","v":{"v":0,"d":"₹0.00"}},{"v":0,"d":"₹0.00"},{"$f":"IFERROR(VLOOKUP(B11,'Product Master'!A:F,6,FALSE),0)","v":{"v":0,"d":"0%"}},{"v":0,"d":"₹0.00"},{"v":0,"d":"₹0.00"}]
[1,null,{"$f":"IFERROR(VLOOKUP(B12,'Product Master'!A:B,2,FALSE),\"\")","v":""},{"$f":"IFERROR(VLOOKUP(B12,'Product Master'!A:I,9,FALSE),0)","v":0},null,{"$f":"IFERROR(VLOOKUP(B12,'Product Master'!A:E,5,FALSE),0)","v":{"v":0,"d":"₹0.00"}},{"v":0,"d":"₹0.00"},{"$f":"IFERROR(VLOOKUP(B12,'Product Master'!A:F,6,FALSE),0)","v":{"v":0,"d":"0%"}},{"v":0,"d":"₹0.00"},{"v":0,"d":"₹0.00"}]
[1,null,{"$f":"IFERROR(VLOOKUP(B13,'Product Master'!A:B,2,FALSE),\"\")","v":""},{"$f":"IFERROR(VLOOKUP(B13,'Product Master'!A:I,9,FALSE),0)","v":0},null,{"$f":"IFERROR(VLOOKUP(B13,'Product Master'!A:E,5,FALSE),0)","v":{"v":0,"d":"₹0.00"}},{"v":0,"d":"₹0.00"},{"$f":"IFERROR(VLOOKUP(B13,'Product Master'!A:F,6,FALSE),0)","v":{"v":0,"d":"0%"}},{"v":0,"d":"₹0.00"},{"v":0,"d":"₹0.00"}]
[1,null,{"$f":"IFERROR(VLOOKUP(B14,'Product Master'!A:B,2,FALSE),\"\")","v":""},{"$f":"IFERROR(VLOOKUP(B14,'Product Master'!A:I,9,FALSE),0)","v":0},null,{"$f":"IFERROR(VLOOKUP(B14,'Product Master'!A:E,5,FALSE),0)","v":{"v":0,"d":"₹0.00"}},{"v":0,"d":"₹0.00"},{"$f":"IFERROR(VLOOKUP(B14,'Product Master'!A:F,6,FALSE),0)","v":{"v":0,"d":"0%"}},{"v":0,"d":"₹0.00"},{"v":0,"d":"₹0.00"}]
[1,null,{"$f":"IFERROR(VLOOKUP(B15,'Product Master'!A:B,2,FALSE),\"\")","v":""},{"$f":"IFERROR(VLOOKUP(B15,'Product Master'!A:I,9,FALSE),0)","v":0},null,{"$f":"IFERROR(VLOOKUP(B15,'Product Master'!A:E,5,FALSE),0)","v":{"v":0,"d":"₹0.00"}},{"v":0,"d":"₹0.00"},{"$f":"IFERROR(VLOOKUP(B15,'Product Master'!A:F,6,FALSE),0)","v":{"v":0,"d":"0%"}},{"v":0,"d":"₹0.00"},{"v":0,"d":"₹0.00"}]
{"$rows_left_out":9}
{"sheet":"Product Master","index":3,"n_rows":4,"n_cols":9,"rows_kept":4}
["Product ID","Product Name","Category","Purchase Price","Selling Price","GST %","Opening Stock","Reorder Level","Current Stock"]
["P001","Sample Soap","FMCG",{"v":30,"d":"₹30.00"},{"v":50,"d":"₹50.00"},{"v":0.18,"d":"18%"},100,20,{"$f":"G2+IFERROR(SUMIFS('Purchase Entry'!F:F,'Purchase Entry'!B:B,A2),0)-IFERROR(SUMIFS(Sales_Log!E:E,Sales_Log!C:C,A2),0)","v":150}]
["P002","Sample Shampoo","FMCG",{"v":120,"d":"₹120.00"},{"v":180,"d":"₹180.00"},{"v":0.18,"d":"18%"},50,10,{"$f":"G3+IFERROR(SUMIFS('Purchase Entry'!F:F,'Purchase Entry'!B:B,A3),0)-IFERROR(SUMIFS(Sales_Log!E:E,Sales_Log!C:C,A3),0)","v":50}]
["P003","Notebook A4","Stationery",{"v":40,"d":"₹40.00"},{"v":60,"d":"₹60.00"},{"v":0.12,"d":"12%"},200,30,{"$f":"G4+IFERROR(SUMIFS('Purchase Entry'!F:F,'Purchase Entry'!B:B,A4),0)-IFERROR(SUMIFS(Sales_Log!E:E,Sales_Log!C:C,A4),0)","v":200}]

{"sheet":"Customer Master","index":4,"n_rows":3,"n_cols":6,"rows_kept":3}
["Customer ID","Customer Name","Phone","Email","Address","GSTIN"]
["C001","Walk-in Customer","-","-","-","-"]
["C002","Rahul Sharma",9876543210,"rahul@email.com","Delhi","07AAACR1234A1Z5"]

{"sheet":"Supplier Master","index":5,"n_rows":2,"n_cols":7,"rows_kept":2}
["Supplier ID","Supplier Name","Contact Person","Phone","Email","Address","GSTIN"]
["S001","ABC Distributors","Mr. Kumar",9000011111,"abc@dist.com","Mumbai","27AABCA1234B1Z5"]

{"sheet":"Purchase Entry","index":6,"n_rows":2,"n_cols":12,"rows_kept":2}
["Purchase Date","Product ID","Product Name","Supplier ID","Supplier Name","Quantity","Purchase Price","Taxable Value","GST %","GST Amount","Total Amount","Bill No."]
["2025-01-01","P001",{"$f":"IFERROR(VLOOKUP(B2,'Product Master'!A:B,2,FALSE),\"\")","v":"Sample Soap"},"S001",{"$f":"IFERROR(VLOOKUP(D2,'Supplier Master'!A:B,2,FALSE),\"\")","v":"ABC Distributors"},50,{"$f":"IFERROR(VLOOKUP(B2,'Product Master'!A:D,4,FALSE),0)","v":{"v":30,"d":"₹30.00"}},{"$f":"F2*G2","v":{"v":1500,"d":"₹1,500.00"}},{"$f":"IFERROR(VLOOKUP(B2,'Product Master'!A:F,6,FALSE),0)","v":{"v":0.18,"d":"18%"}},{"$f":"H2*I2","v":{"v":270,"d":"₹270.00"}},{"$f":"H2+J2","v":{"v":1770,"d":"₹1,770.00"}},"PB-001"]

{"sheet":"Stock Register","index":7,"n_rows":50,"n_cols":8,"rows_kept":50,"merged":[[0,0,0,7]]}
["STOCK REGISTER (Live)"]
[]
["Product ID","Product Name","Opening Stock","Total Purchased","Total Sold","Current Stock","Reorder Level","Status"]
[{"$f":"IFERROR('Product Master'!A2,\"\")","v":"P001"},{"$f":"IFERROR('Product Master'!B2,\"\")","v":"Sample Soap"},{"$f":"IFERROR('Product Master'!G2,0)","v":100},{"$f":"IFERROR(SUMIFS('Purchase Entry'!F:F,'Purchase Entry'!B:B,A4),0)","v":50},{"$f":"IFERROR(SUMIFS(Sales_Log!E:E,Sales_Log!C:C,A4),0)","v":0},{"$f":"C4+D4-E4","v":150},{"$f":"IFERROR('Product Master'!H2,0)","v":20},{"$f":"IF(A4=\"\",\"\",IF(F4<=0,\"OUT OF STOCK\",IF(F4<=G4,\"LOW STOCK\",\"OK\")))","v":"OK"}]
[{"$f":"IFERROR('Product Master'!A3,\"\")","v":"P002"},{"$f":"IFERROR('Product Master'!B3,\"\")","v":"Sample Shampoo"},{"$f":"IFERROR('Product Master'!G3,0)","v":50},{"$f":"IFERROR(SUMIFS('Purchase Entry'!F:F,'Purchase Entry'!B:B,A5),0)","v":0},{"$f":"IFERROR(SUMIFS(Sales_Log!E:E,Sales_Log!C:C,A5),0)","v":0},{"$f":"C5+D5-E5","v":50},{"$f":"IFERROR('Product Master'!H3,0)","v":10},{"$f":"IF(A5=\"\",\"\",IF(F5<=0,\"OUT OF STOCK\",IF(F5<=G5,\"LOW STOCK\",\"OK\")))","v":"OK"}]
[{"$f":"IFERROR('Product Master'!A4,\"\")","v":"P003"},{"$f":"IFERROR('Product Master'!B4,\"\")","v":"Notebook A4"},{"$f":"IFERROR('Product Master'!G4,0)","v":200},{"$f":"IFERROR(SUMIFS('Purchase Entry'!F:F,'Purchase Entry'!B:B,A6),0)","v":0},{"$f":"IFERROR(SUMIFS(Sales_Log!E:E,Sales_Log!C:C,A6),0)","v":0},200,{"$f":"IFERROR('Product Master'!H4,0)","v":30},"OK"]
[{"$f":"IFERROR('Product Master'!A5,\"\")","v":0},{"$f":"IFERROR('Product Master'!B5,\"\")","v":0},{"$f":"IFERROR('Product Master'!G5,0)","v":0},{"$f":"IFERROR(SUMIFS('Purchase Entry'!F:F,'Purchase Entry'!B:B,A7),0)","v":0},{"$f":"IFERROR(SUMIFS(Sales_Log!E:E,Sales_Log!C:C,A7),0)","v":0},0,{"$f":"IFERROR('Product Master'!H5,0)","v":0},"OUT OF STOCK"]
[{"$f":"IFERROR('Product Master'!A6,\"\")","v":0},{"$f":"IFERROR('Product Master'!B6,\"\")","v":0},{"$f":"IFERROR('Product Master'!G6,0)","v":0},{"$f":"IFERROR(SUMIFS('Purchase Entry'!F:F,'Purchase Entry'!B:B,A8),0)","v":0},{"$f":"IFERROR(SUMIFS(Sales_Log!E:E,Sales_Log!C:C,A8),0)","v":0},0,{"$f":"IFERROR('Product Master'!H6,0)","v":0},"OUT OF STOCK"]
[{"$f":"IFERROR('Product Master'!A7,\"\")","v":0},{"$f":"IFERROR('Product Master'!B7,\"\")","v":0},{"$f":"IFERROR('Product Master'!G7,0)","v":0},{"$f":"IFERROR(SUMIFS('Purchase Entry'!F:F,'Purchase Entry'!B:B,A9),0)","v":0},{"$f":"IFERROR(SUMIFS(Sales_Log!E:E,Sales_Log!C:C,A9),0)","v":0},0,{"$f":"IFERROR('Product Master'!H7,0)","v":0},"OUT OF STOCK"]
[{"$f":"IFERROR('Product Master'!A8,\"\")","v":0},{"$f":"IFERROR('Product Master'!B8,\"\")","v":0},{"$f":"IFERROR('Product Master'!G8,0)","v":0},{"$f":"IFERROR(SUMIFS('Purchase Entry'!F:F,'Purchase Entry'!B:B,A10),0)","v":0},{"$f":"IFERROR(SUMIFS(Sales_Log!E:E,Sales_Log!C:C,A10),0)","v":0},0,{"$f":"IFERROR('Product Master'!H8,0)","v":0},"OUT OF STOCK"]
[{"$f":"IFERROR('Product Master'!A9,\"\")","v":0},{"$f":"IFERROR('Product Master'!B9,\"\")","v":0},{"$f":"IFERROR('Product Master'!G9,0)","v":0},{"$f":"IFERROR(SUMIFS('Purchase Entry'!F:F,'Purchase Entry'!B:B,A11),0)","v":0},{"$f":"IFERROR(SUMIFS(Sales_Log!E:E,Sales_Log!C:C,A11),0)","v":0},0,{"$f":"IFERROR('Product Master'!H9,0)","v":0},"OUT OF STOCK"]
[{"$f":"IFERROR('Product Master'!A10,\"\")","v":0},{"$f":"IFERROR('Product Master'!B10,\"\")","v":0},{"$f":"IFERROR('Product Master'!G10,0)","v":0},{"$f":"IFERROR(SUMIFS('Purchase Entry'!F:F,'Purchase Entry'!B:B,A12),0)","v":0},{"$f":"IFERROR(SUMIFS(Sales_Log!E:E,Sales_Log!C:C,A12),0)","v":0},0,{"$f":"IFERROR('Product Master'!H10,0)","v":0},"OUT OF STOCK"]
[{"$f":"IFERROR('Product Master'!A11,\"\")","v":0},{"$f":"IFERROR('Product Master'!B11,\"\")","v":0},{"$f":"IFERROR('Product Master'!G11,0)","v":0},{"$f":"IFERROR(SUMIFS('Purchase Entry'!F:F,'Purchase Entry'!B:B,A13),0)","v":0},{"$f":"IFERROR(SUMIFS(Sales_Log!E:E,Sales_Log!C:C,A13),0)","v":0},0,{"$f":"IFERROR('Product Master'!H11,0)","v":0},"OUT OF STOCK"]
[{"$f":"IFERROR('Product Master'!A12,\"\")","v":0},{"$f":"IFERROR('Product Master'!B12,\"\")","v":0},{"$f":"IFERROR('Product Master'!G12,0)","v":0},{"$f":"IFERROR(SUMIFS('Purchase Entry'!F:F,'Purchase Entry'!B:B,A14),0)","v":0},{"$f":"IFERROR(SUMIFS(Sales_Log!E:E,Sales_Log!C:C,A14),0)","v":0},0,{"$f":"IFERROR('Product Master'!H12,0)","v":0},"OUT OF STOCK"]
[{"$f":"IFERROR('Product Master'!A13,\"\")","v":0},{"$f":"IFERROR('Product Master'!B13,\"\")","v":0},{"$f":"IFERROR('Product Master'!G13,0)","v":0},{"$f":"IFERROR(SUMIFS('Purchase Entry'!F:F,'Purchase Entry'!B:B,A15),0)","v":0},{"$f":"IFERROR(SUMIFS(Sales_Log!E:E,Sales_Log!C:C,A15),0)","v":0},0,{"$f":"IFERROR('Product Master'!H13,0)","v":0},"OUT OF STOCK"]
{"$rows_left_out":36}
{"sheet":"Reports","index":8,"n_rows":14,"n_cols":5,"rows_kept":14}
["📊 REPORTS"]
[]
["Date Filter:","From",{"$f":"TODAY()-30","v":"2026-04-01"},"To",{"$f":"TODAY()","v":"2026-05-01"}]
[]
["SALES REPORT",null,null,"PURCHASE REPORT"]
["Total Invoices",{"$f":"SUMPRODUCT((Sales_Log!B2:B10000>=C3)*(Sales_Log!B2:B10000<=E3)*(Sales_Log!A2:A10000<>\"\")/COUNTIF(Sales_Log!A2:A10000,Sales_Log!A2:A10000&\"\"))","v":0},null,"Total Purchases (Taxable)",{"$f":"SUMIFS('Purchase Entry'!H:H,'Purchase Entry'!A:A,\">=\"&C3,'Purchase Entry'!A:A,\"<=\"&E3)","v":{"v":0,"d":"₹0.00"}}]
["Total Sales (Taxable)",{"$f":"SUMIFS(Sales_Log!G:G,Sales_Log!B:B,\">=\"&C3,Sales_Log!B:B,\"<=\"&E3)","v":{"v":0,"d":"₹0.00"}},null,"Total Purchase GST",{"$f":"SUMIFS('Purchase Entry'!J:J,'Purchase Entry'!A:A,\">=\"&C3,'Purchase Entry'!A:A,\"<=\"&E3)","v":{"v":0,"d":"₹0.00"}}]
["Total GST Collected",{"$f":"SUMIFS(Sales_Log!I:I,Sales_Log!B:B,\">=\"&C3,Sales_Log!B:B,\"<=\"&E3)","v":{"v":0,"d":"₹0.00"}},null,"Total Purchases (with GST)",{"$f":"SUMIFS('Purchase Entry'!K:K,'Purchase Entry'!A:A,\">=\"&C3,'Purchase Entry'!A:A,\"<=\"&E3)","v":{"v":0,"d":"₹0.00"}}]
["Total Sales (with GST)",{"$f":"SUMIFS(Sales_Log!J:J,Sales_Log!B:B,\">=\"&C3,Sales_Log!B:B,\"<=\"&E3)","v":{"v":0,"d":"₹0.00"}}]
["Total Profit",{"$f":"SUMIFS(Sales_Log!O:O,Sales_Log!B:B,\">=\"&C3,Sales_Log!B:B,\"<=\"&E3)","v":{"v":0,"d":"₹0.00"}}]
[]
["STOCK SUMMARY (see Stock Register tab for live ledger)"]
["Items Out of Stock",{"$f":"COUNTIF('Stock Register'!H:H,\"OUT OF STOCK\")","v":44}]
["Items at Low Stock",{"$f":"COUNTIF('Stock Register'!H:H,\"LOW STOCK\")","v":0}]

{"sheet":"Sales_Log","index":9,"n_rows":1,"n_cols":15,"rows_kept":1}
["Invoice No","Date","Product ID","Product Name","Quantity","Selling Price","Taxable Value","GST %","GST Amount","Total Amount","Customer ID","Customer Name","Payment Mode","Purchase Price","Profit"]

{"sheet":"Invoice_Print","index":10,"n_rows":28,"n_cols":8,"rows_kept":28,"merged":[[0,0,0,7]]}
["TAX INVOICE"]
[]
["Your Shop Name",{"$nulls":4},"Invoice No:",{"$f":"Sales!B3","v":"INV-0001"}]
["Address Line 1, City - PIN",{"$nulls":4},"Date:",{"$f":"Sales!E3","v":"2026-05-01"}]
["GSTIN: 00XXXXXXXXXXXXX  |  Phone: 9999999999",{"$nulls":4},"Payment:",{"$f":"Sales!H3","v":"Cash"}]
[]
["Bill To:",{"$f":"Sales!E4","v":"Walk-in Customer"}]
["Phone:",{"$f":"Sales!H4","v":"-"}]
[]
["#","Product","Qty","Price","Taxable","GST%","GST","Total"]
[{"$f":"IF(Sales!B7=\"\",\"\",Sales!A7)","v":1},{"$f":"IF(Sales!B7=\"\",\"\",Sales!C7)","v":"Sample Soap"},{"$f":"IF(Sales!B7=\"\",\"\",Sales!E7)","v":0},{"$f":"IF(Sales!B7=\"\",\"\",Sales!F7)","v":{"v":50,"d":"₹50.00"}},{"$f":"IF(Sales!B7=\"\",\"\",Sales!G7)","v":{"v":0,"d":"₹0.00"}},{"$f":"IF(Sales!B7=\"\",\"\",Sales!H7)","v":{"v":0.18,"d":"18%"}},{"$f":"IF(Sales!B7=\"\",\"\",Sales!I7)","v":{"v":0,"d":"₹0.00"}},{"$f":"IF(Sales!B7=\"\",\"\",Sales!J7)","v":{"v":0,"d":"₹0.00"}}]
[{"$f":"IF(Sales!B8=\"\",\"\",Sales!A8)","v":1},{"$f":"IF(Sales!B8=\"\",\"\",Sales!C8)","v":"Sample Shampoo"},{"$f":"IF(Sales!B8=\"\",\"\",Sales!E8)","v":0},{"$f":"IF(Sales!B8=\"\",\"\",Sales!F8)","v":{"v":180,"d":"₹180.00"}},{"$f":"IF(Sales!B8=\"\",\"\",Sales!G8)","v":{"v":0,"d":"₹0.00"}},{"$f":"IF(Sales!B8=\"\",\"\",Sales!H8)","v":{"v":0.18,"d":"18%"}},{"$f":"IF(Sales!B8=\"\",\"\",Sales!I8)","v":{"v":0,"d":"₹0.00"}},{"$f":"IF(Sales!B8=\"\",\"\",Sales!J8)","v":{"v":0,"d":"₹0.00"}}]
[{"$f":"IF(Sales!B9=\"\",\"\",Sales!A9)","v":""},{"$f":"IF(Sales!B9=\"\",\"\",Sales!C9)","v":""},{"$f":"IF(Sales!B9=\"\",\"\",Sales!E9)","v":""},{"$f":"IF(Sales!B9=\"\",\"\",Sales!F9)","v":""},{"$f":"IF(Sales!B9=\"\",\"\",Sales!G9)","v":""},{"$f":"IF(Sales!B9=\"\",\"\",Sales!H9)","v":""},{"$f":"IF(Sales!B9=\"\",\"\",Sales!I9)","v":""},{"$f":"IF(Sales!B9=\"\",\"\",Sales!J9)","v":""}]
[{"$f":"IF(Sales!B10=\"\",\"\",Sales!A10)","v":""},{"$f":"IF(Sales!B10=\"\",\"\",Sales!C10)","v":""},{"$f":"IF(Sales!B10=\"\",\"\",Sales!E10)","v":""},{"$f":"IF(Sales!B10=\"\",\"\",Sales!F10)","v":""},{"$f":"IF(Sales!B10=\"\",\"\",Sales!G10)","v":""},{"$f":"IF(Sales!B10=\"\",\"\",Sales!H10)","v":""},{"$f":"IF(Sales!B10=\"\",\"\",Sales!I10)","v":""},{"$f":"IF(Sales!B10=\"\",\"\",Sales!J10)","v":""}]
[{"$f":"IF(Sales!B11=\"\",\"\",Sales!A11)","v":""},{"$f":"IF(Sales!B11=\"\",\"\",Sales!C11)","v":""},{"$f":"IF(Sales!B11=\"\",\"\",Sales!E11)","v":""},{"$f":"IF(Sales!B11=\"\",\"\",Sales!F11)","v":""},{"$f":"IF(Sales!B11=\"\",\"\",Sales!G11)","v":""},{"$f":"IF(Sales!B11=\"\",\"\",Sales!H11)","v":""},{"$f":"IF(Sales!B11=\"\",\"\",Sales!I11)","v":""},{"$f":"IF(Sales!B11=\"\",\"\",Sales!J11)","v":""}]
{"$rows_left_out":13}